{"text_format":"1","workbook":"xlsx","n_sheets":2,"sheets":["Kämpfe","Kühe"],"not_rendered":{"charts":0,"images":1,"macros":1,"external_links":0,"defined_names":3,"comments":0,"pivot_tables":0},"unopened":[],"bounds":{"document_bytes":16777216,"sheet_cells":100000,"rows_first":2000,"rows_last":500,"rows_between":2000,"halvings":0,"cell_chars":16384,"cell_head_chars":4096},"cells_cut":0,"cells_raw":0,"read":"whole","date_system":"1900"}

{"sheet":"Kämpfe","index":0,"n_rows":1229,"n_cols":12,"rows_kept":1229,"cut":false,"hidden":false,"merged":[[1,1,1,3],[1,4,1,6]]}
[null,null,null,null,null,null,null,null,"Kuh Nr.",null,"Anzahl Kämpfe","Gewonnen"]
[null,"Gewinner",null,null,"Verlierer",null,null,null,null,null,{"$f":"COUNTIFS($D$4:$E$2999,$I$2)","v":0},{"$f":"COUNTIFS($D$4:$D$2999,$I$2)","v":0}]
["Datum","Besitzer","Name","Nr.","Nr.2","Name2","Besitzer2"]
["2018-09-13",{"$f":"VLOOKUP(D4,Kühe!$A$7:$G$150,7,FALSE)","v":"Jäger Carlo"},{"$f":"VLOOKUP(D4,Kühe!$A$7:$G$150,2,FALSE)","v":"Maila"},52,63,{"$f":"VLOOKUP(E4,Kühe!$A$7:$G$150,2,FALSE)","v":"Belon"},{"$f":"VLOOKUP(E4,Kühe!$A$7:$G$150,7,FALSE)","v":"Mathieu Leander & Sascha"}]
["2018-09-13",{"$f":"VLOOKUP(D5,Kühe!$A$7:$G$150,7,FALSE)","v":"Stallung Passeraub"},{"$f":"VLOOKUP(D5,Kühe!$A$7:$G$150,2,FALSE)","v":"Bulle"},68,86,{"$f":"VLOOKUP(E5,Kühe!$A$7:$G$150,2,FALSE)","v":"Lotus"},{"$f":"VLOOKUP(E5,Kühe!$A$7:$G$150,7,FALSE)","v":"Williner  Anton"}]
["2018-09-13",{"$f":"VLOOKUP(D6,Kühe!$A$7:$G$150,7,FALSE)","v":"Sewer Ralf & Thommen Steve"},{"$f":"VLOOKUP(D6,Kühe!$A$7:$G$150,2,FALSE)","v":"Gonda"},76,73,{"$f":"VLOOKUP(E6,Kühe!$A$7:$G$150,2,FALSE)","v":"Benika"},{"$f":"VLOOKUP(E6,Kühe!$A$7:$G$150,7,FALSE)","v":"Stallung zum Stäg"}]
["2018-09-13",{"$f":"VLOOKUP(D7,Kühe!$A$7:$G$150,7,FALSE)","v":"Jäger Carlo"},{"$f":"VLOOKUP(D7,Kühe!$A$7:$G$150,2,FALSE)","v":"Paloma"},54,104,{"$f":"VLOOKUP(E7,Kühe!$A$7:$G$150,2,FALSE)","v":"Pengale"},{"$f":"VLOOKUP(E7,Kühe!$A$7:$G$150,7,FALSE)","v":"Zumofen / Gattlen"}]
["2018-09-13",{"$f":"VLOOKUP(D8,Kühe!$A$7:$G$150,7,FALSE)","v":"Sewer Ralf & Thommen Steve"},{"$f":"VLOOKUP(D8,Kühe!$A$7:$G$150,2,FALSE)","v":"Saphira"},77,16,{"$f":"VLOOKUP(E8,Kühe!$A$7:$G$150,2,FALSE)","v":"Cora"},{"$f":"VLOOKUP(E8,Kühe!$A$7:$G$150,7,FALSE)","v":"Bregy Uli & Pascal"}]
["2018-09-13",{"$f":"VLOOKUP(D9,Kühe!$A$7:$G$150,7,FALSE)","v":"Jäger Carlo"},{"$f":"VLOOKUP(D9,Kühe!$A$7:$G$150,2,FALSE)","v":"Paloma"},54,53,{"$f":"VLOOKUP(E9,Kühe!$A$7:$G$150,2,FALSE)","v":"Mirtille"},{"$f":"VLOOKUP(E9,Kühe!$A$7:$G$150,7,FALSE)","v":"Jäger Carlo"}]
["2018-09-13",{"$f":"VLOOKUP(D10,Kühe!$A$7:$G$150,7,FALSE)","v":"Bregy Ralf & Adolf"},{"$f":"VLOOKUP(D10,Kühe!$A$7:$G$150,2,FALSE)","v":"Canaille"},7,9,{"$f":"VLOOKUP(E10,Kühe!$A$7:$G$150,2,FALSE)","v":"Flacari"},{"$f":"VLOOKUP(E10,Kühe!$A$7:$G$150,7,FALSE)","v":"Bregy Ralf & Adolf"}]
["2018-09-12",{"$f":"VLOOKUP(D11,Kühe!$A$7:$G$150,7,FALSE)","v":"Jäger Carlo"},{"$f":"VLOOKUP(D11,Kühe!$A$7:$G$150,2,FALSE)","v":"Turin"},58,46,{"$f":"VLOOKUP(E11,Kühe!$A$7:$G$150,2,FALSE)","v":"Lorens"},{"$f":"VLOOKUP(E11,Kühe!$A$7:$G$150,7,FALSE)","v":"Gebrüder Jäger"}]
["2018-09-12",{"$f":"VLOOKUP(D12,Kühe!$A$7:$G$150,7,FALSE)","v":"Jäger Carlo"},{"$f":"VLOOKUP(D12,Kühe!$A$7:$G$150,2,FALSE)","v":"Guxa"},51,94,{"$f":"VLOOKUP(E12,Kühe!$A$7:$G$150,2,FALSE)","v":"Xanja"},{"$f":"VLOOKUP(E12,Kühe!$A$7:$G$150,7,FALSE)","v":"Wyssen Diego & Madlen"}]
["2018-09-12",{"$f":"VLOOKUP(D13,Kühe!$A$7:$G$150,7,FALSE)","v":"Stallung Passeraub"},{"$f":"VLOOKUP(D13,Kühe!$A$7:$G$150,2,FALSE)","v":"Bombache"},67,51,{"$f":"VLOOKUP(E13,Kühe!$A$7:$G$150,2,FALSE)","v":"Guxa"},{"$f":"VLOOKUP(E13,Kühe!$A$7:$G$150,7,FALSE)","v":"Jäger Carlo"}]
["2018-09-12",{"$f":"VLOOKUP(D14,Kühe!$A$7:$G$150,7,FALSE)","v":"Bregy Patrick & Silvan"},{"$f":"VLOOKUP(D14,Kühe!$A$7:$G$150,2,FALSE)","v":"Milow"},12,110,{"$f":"VLOOKUP(E14,Kühe!$A$7:$G$150,2,FALSE)","v":"Xena"},{"$f":"VLOOKUP(E14,Kühe!$A$7:$G$150,7,FALSE)","v":"Zumofen / Gattlen"}]
["2018-09-12",{"$f":"VLOOKUP(D15,Kühe!$A$7:$G$150,7,FALSE)","v":"Jäger Carlo"},{"$f":"VLOOKUP(D15,Kühe!$A$7:$G$150,2,FALSE)","v":"Bandit"},50,61,{"$f":"VLOOKUP(E15,Kühe!$A$7:$G$150,2,FALSE)","v":"Baronesse"},{"$f":"VLOOKUP(E15,Kühe!$A$7:$G$150,7,FALSE)","v":"Mathieu Leander & Sascha"}]
["2018-09-12",{"$f":"VLOOKUP(D16,Kühe!$A$7:$G$150,7,FALSE)","v":"Hischier Pius"},{"$f":"VLOOKUP(D16,Kühe!$A$7:$G$150,2,FALSE)","v":"Pablo"},47,97,{"$f":"VLOOKUP(E16,Kühe!$A$7:$G$150,2,FALSE)","v":"Coucou"},{"$f":"VLOOKUP(E16,Kühe!$A$7:$G$150,7,FALSE)","v":"Familie Zumoberhaus"}]
["2018-09-12",{"$f":"VLOOKUP(D17,Kühe!$A$7:$G$150,7,FALSE)","v":"Hischier Pius"},{"$f":"VLOOKUP(D17,Kühe!$A$7:$G$150,2,FALSE)","v":"Pelila"},48,62,{"$f":"VLOOKUP(E17,Kühe!$A$7:$G$150,2,FALSE)","v":"Bavaria"},{"$f":"VLOOKUP(E17,Kühe!$A$7:$G$150,7,FALSE)","v":"Mathieu Leander & Sascha"}]
["2018-09-12",{"$f":"VLOOKUP(D18,Kühe!$A$7:$G$150,7,FALSE)","v":"Hischier Pius"},{"$f":"VLOOKUP(D18,Kühe!$A$7:$G$150,2,FALSE)","v":"Pelila"},48,106,{"$f":"VLOOKUP(E18,Kühe!$A$7:$G$150,2,FALSE)","v":"Rambo"},{"$f":"VLOOKUP(E18,Kühe!$A$7:$G$150,7,FALSE)","v":"Zumofen / Gattlen"}]
["2018-09-12",{"$f":"VLOOKUP(D19,Kühe!$A$7:$G$150,7,FALSE)","v":"Tscherry Erwin & Bernhard"},{"$f":"VLOOKUP(D19,Kühe!$A$7:$G$150,2,FALSE)","v":"Carolin"},82,47,{"$f":"VLOOKUP(E19,Kühe!$A$7:$G$150,2,FALSE)","v":"Pablo"},{"$f":"VLOOKUP(E19,Kühe!$A$7:$G$150,7,FALSE)","v":"Hischier Pius"}]
["2018-09-12",{"$f":"VLOOKUP(D20,Kühe!$A$7:$G$150,7,FALSE)","v":"Jäger Carlo"},{"$f":"VLOOKUP(D20,Kühe!$A$7:$G$150,2,FALSE)","v":"Turin"},58,75,{"$f":"VLOOKUP(E20,Kühe!$A$7:$G$150,2,FALSE)","v":"Pandora"},{"$f":"VLOOKUP(E20,Kühe!$A$7:$G$150,7,FALSE)","v":"Stallung zum Stäg"}]
["2018-09-12",{"$f":"VLOOKUP(D21,Kühe!$A$7:$G$150,7,FALSE)","v":"Fux Wendelin, Jenny & Wyer Piet"},{"$f":"VLOOKUP(D21,Kühe!$A$7:$G$150,2,FALSE)","v":"Andora"},25,46,{"$f":"VLOOKUP(E21,Kühe!$A$7:$G$150,2,FALSE)","v":"Lorens"},{"$f":"VLOOKUP(E21,Kühe!$A$7:$G$150,7,FALSE)","v":"Gebrüder Jäger"}]
["2018-09-12",{"$f":"VLOOKUP(D22,Kühe!$A$7:$G$150,7,FALSE)","v":"Tscherry Erwin & Bernhard"},{"$f":"VLOOKUP(D22,Kühe!$A$7:$G$150,2,FALSE)","v":"Carolin"},82,19,{"$f":"VLOOKUP(E22,Kühe!$A$7:$G$150,2,FALSE)","v":"Tiranie"},{"$f":"VLOOKUP(E22,Kühe!$A$7:$G$150,7,FALSE)","v":"Bregy Uli & Pascal"}]
["2018-09-12",{"$f":"VLOOKUP(D23,Kühe!$A$7:$G$150,7,FALSE)","v":"Bregy Patrick & Silvan"},{"$f":"VLOOKUP(D23,Kühe!$A$7:$G$150,2,FALSE)","v":"Milow"},12,102,{"$f":"VLOOKUP(E23,Kühe!$A$7:$G$150,2,FALSE)","v":"Fayola"},{"$f":"VLOOKUP(E23,Kühe!$A$7:$G$150,7,FALSE)","v":"Zumofen / Gattlen"}]
["2018-09-12",{"$f":"VLOOKUP(D24,Kühe!$A$7:$G$150,7,FALSE)","v":"Williner  Anton"},{"$f":"VLOOKUP(D24,Kühe!$A$7:$G$150,2,FALSE)","v":"Colonell"},88,100,{"$f":"VLOOKUP(E24,Kühe!$A$7:$G$150,2,FALSE)","v":"Akhira"},{"$f":"VLOOKUP(E24,Kühe!$A$7:$G$150,7,FALSE)","v":"Zumofen / Gattlen"}]
["2018-09-12",{"$f":"VLOOKUP(D25,Kühe!$A$7:$G$150,7,FALSE)","v":"Jäger Carlo"},{"$f":"VLOOKUP(D25,Kühe!$A$7:$G$150,2,FALSE)","v":"Paloma"},54,104,{"$f":"VLOOKUP(E25,Kühe!$A$7:$G$150,2,FALSE)","v":"Pengale"},{"$f":"VLOOKUP(E25,Kühe!$A$7:$G$150,7,FALSE)","v":"Zumofen / Gattlen"}]
["2018-09-12",{"$f":"VLOOKUP(D26,Kühe!$A$7:$G$150,7,FALSE)","v":"Stallung zum Stäg"},{"$f":"VLOOKUP(D26,Kühe!$A$7:$G$150,2,FALSE)","v":"Pandora"},75,40,{"$f":"VLOOKUP(E26,Kühe!$A$7:$G$150,2,FALSE)","v":"Barilona"},{"$f":"VLOOKUP(E26,Kühe!$A$7:$G$150,7,FALSE)","v":"Gebrüder Jäger"}]
["2018-09-11",{"$f":"VLOOKUP(D27,Kühe!$A$7:$G$150,7,FALSE)","v":"Gebrüder Jäger"},{"$f":"VLOOKUP(D27,Kühe!$A$7:$G$150,2,FALSE)","v":"Tango"},37,32,{"$f":"VLOOKUP(E27,Kühe!$A$7:$G$150,2,FALSE)","v":"Pigalle"},{"$f":"VLOOKUP(E27,Kühe!$A$7:$G$150,7,FALSE)","v":"Fux Wendelin, Jenny & Wyer Piet"}]
["2018-09-11",{"$f":"VLOOKUP(D28,Kühe!$A$7:$G$150,7,FALSE)","v":"Gebrüder Jäger"},{"$f":"VLOOKUP(D28,Kühe!$A$7:$G$150,2,FALSE)","v":"Lorens"},46,42,{"$f":"VLOOKUP(E28,Kühe!$A$7:$G$150,2,FALSE)","v":"Tiger"},{"$f":"VLOOKUP(E28,Kühe!$A$7:$G$150,7,FALSE)","v":"Gebrüder Jäger"}]
["2018-09-11",{"$f":"VLOOKUP(D29,Kühe!$A$7:$G$150,7,FALSE)","v":"Bayard Medard & Gustav"},{"$f":"VLOOKUP(D29,Kühe!$A$7:$G$150,2,FALSE)","v":"Pinka"},3,97,{"$f":"VLOOKUP(E29,Kühe!$A$7:$G$150,2,FALSE)","v":"Coucou"},{"$f":"VLOOKUP(E29,Kühe!$A$7:$G$150,7,FALSE)","v":"Familie Zumoberhaus"}]
["2018-09-11",{"$f":"VLOOKUP(D30,Kühe!$A$7:$G$150,7,FALSE)","v":"Mathieu Leander & Sascha"},{"$f":"VLOOKUP(D30,Kühe!$A$7:$G$150,2,FALSE)","v":"Belon"},63,31,{"$f":"VLOOKUP(E30,Kühe!$A$7:$G$150,2,FALSE)","v":"Mystic"},{"$f":"VLOOKUP(E30,Kühe!$A$7:$G$150,7,FALSE)","v":"Fux Wendelin, Jenny & Wyer Piet"}]
["2018-09-11",{"$f":"VLOOKUP(D31,Kühe!$A$7:$G$150,7,FALSE)","v":"Stallung zum Stäg"},{"$f":"VLOOKUP(D31,Kühe!$A$7:$G$150,2,FALSE)","v":"Diaries"},74,43,{"$f":"VLOOKUP(E31,Kühe!$A$7:$G$150,2,FALSE)","v":"Dorina"},{"$f":"VLOOKUP(E31,Kühe!$A$7:$G$150,7,FALSE)","v":"Gebrüder Jäger"}]
["2018-09-11",{"$f":"VLOOKUP(D32,Kühe!$A$7:$G$150,7,FALSE)","v":"Mathieu Leander & Sascha"},{"$f":"VLOOKUP(D32,Kühe!$A$7:$G$150,2,FALSE)","v":"Belon"},63,99,{"$f":"VLOOKUP(E32,Kühe!$A$7:$G$150,2,FALSE)","v":"Napapiri"},{"$f":"VLOOKUP(E32,Kühe!$A$7:$G$150,7,FALSE)","v":"Familie Zumoberhaus"}]
["2018-09-11",{"$f":"VLOOKUP(D33,Kühe!$A$7:$G$150,7,FALSE)","v":"Familie Zumoberhaus"},{"$f":"VLOOKUP(D33,Kühe!$A$7:$G$150,2,FALSE)","v":"Coucou"},97,23,{"$f":"VLOOKUP(E33,Kühe!$A$7:$G$150,2,FALSE)","v":"Rebell"},{"$f":"VLOOKUP(E33,Kühe!$A$7:$G$150,7,FALSE)","v":"Familie Leiggener"}]
["2018-09-11",{"$f":"VLOOKUP(D34,Kühe!$A$7:$G$150,7,FALSE)","v":"Zumofen / Gattlen"},{"$f":"VLOOKUP(D34,Kühe!$A$7:$G$150,2,FALSE)","v":"Puma"},105,14,{"$f":"VLOOKUP(E34,Kühe!$A$7:$G$150,2,FALSE)","v":"Calin"},{"$f":"VLOOKUP(E34,Kühe!$A$7:$G$150,7,FALSE)","v":"Bregy Uli & Pascal"}]
["2018-09-11",{"$f":"VLOOKUP(D35,Kühe!$A$7:$G$150,7,FALSE)","v":"Bregy Patrick & Silvan"},{"$f":"VLOOKUP(D35,Kühe!$A$7:$G$150,2,FALSE)","v":"Tequilla"},13,32,{"$f":"VLOOKUP(E35,Kühe!$A$7:$G$150,2,FALSE)","v":"Pigalle"},{"$f":"VLOOKUP(E35,Kühe!$A$7:$G$150,7,FALSE)","v":"Fux Wendelin, Jenny & Wyer Piet"}]
["2018-09-11",{"$f":"VLOOKUP(D36,Kühe!$A$7:$G$150,7,FALSE)","v":"Williner  Anton"},{"$f":"VLOOKUP(D36,Kühe!$A$7:$G$150,2,FALSE)","v":"Colonell"},88,100,{"$f":"VLOOKUP(E36,Kühe!$A$7:$G$150,2,FALSE)","v":"Akhira"},{"$f":"VLOOKUP(E36,Kühe!$A$7:$G$150,7,FALSE)","v":"Zumofen / Gattlen"}]
["2018-09-11",{"$f":"VLOOKUP(D37,Kühe!$A$7:$G$150,7,FALSE)","v":"Bregy Uli & Pascal"},{"$f":"VLOOKUP(D37,Kühe!$A$7:$G$150,2,FALSE)","v":"Pandora"},17,49,{"$f":"VLOOKUP(E37,Kühe!$A$7:$G$150,2,FALSE)","v":"Shakira"},{"$f":"VLOOKUP(E37,Kühe!$A$7:$G$150,7,FALSE)","v":"Hischier Pius"}]
["2018-09-11",{"$f":"VLOOKUP(D38,Kühe!$A$7:$G$150,7,FALSE)","v":"Gebrüder Jäger"},{"$f":"VLOOKUP(D38,Kühe!$A$7:$G$150,2,FALSE)","v":"Tirana"},38,71,{"$f":"VLOOKUP(E38,Kühe!$A$7:$G$150,2,FALSE)","v":"Bonita"},{"$f":"VLOOKUP(E38,Kühe!$A$7:$G$150,7,FALSE)","v":"Stallung Passeraub"}]
["2018-09-11",{"$f":"VLOOKUP(D39,Kühe!$A$7:$G$150,7,FALSE)","v":"Familie Leiggener"},{"$f":"VLOOKUP(D39,Kühe!$A$7:$G$150,2,FALSE)","v":"Rambo"},22,102,{"$f":"VLOOKUP(E39,Kühe!$A$7:$G$150,2,FALSE)","v":"Fayola"},{"$f":"VLOOKUP(E39,Kühe!$A$7:$G$150,7,FALSE)","v":"Zumofen / Gattlen"}]
["2018-09-11",{"$f":"VLOOKUP(D40,Kühe!$A$7:$G$150,7,FALSE)","v":"Zumofen / Gattlen"},{"$f":"VLOOKUP(D40,Kühe!$A$7:$G$150,2,FALSE)","v":"Puma"},105,22,{"$f":"VLOOKUP(E40,Kühe!$A$7:$G$150,2,FALSE)","v":"Rambo"},{"$f":"VLOOKUP(E40,Kühe!$A$7:$G$150,7,FALSE)","v":"Familie Leiggener"}]
["2018-09-11",{"$f":"VLOOKUP(D41,Kühe!$A$7:$G$150,7,FALSE)","v":"Sewer Ralf & Thommen Steve"},{"$f":"VLOOKUP(D41,Kühe!$A$7:$G$150,2,FALSE)","v":"Saphira"},77,16,{"$f":"VLOOKUP(E41,Kühe!$A$7:$G$150,2,FALSE)","v":"Cora"},{"$f":"VLOOKUP(E41,Kühe!$A$7:$G$150,7,FALSE)","v":"Bregy Uli & Pascal"}]
["2018-09-11",{"$f":"VLOOKUP(D42,Kühe!$A$7:$G$150,7,FALSE)","v":"Zumofen / Gattlen"},{"$f":"VLOOKUP(D42,Kühe!$A$7:$G$150,2,FALSE)","v":"Pengale"},104,23,{"$f":"VLOOKUP(E42,Kühe!$A$7:$G$150,2,FALSE)","v":"Rebell"},{"$f":"VLOOKUP(E42,Kühe!$A$7:$G$150,7,FALSE)","v":"Familie Leiggener"}]
["2018-09-11",{"$f":"VLOOKUP(D43,Kühe!$A$7:$G$150,7,FALSE)","v":"Hischier Pius"},{"$f":"VLOOKUP(D43,Kühe!$A$7:$G$150,2,FALSE)","v":"Pelila"},48,60,{"$f":"VLOOKUP(E43,Kühe!$A$7:$G$150,2,FALSE)","v":"Bambino"},{"$f":"VLOOKUP(E43,Kühe!$A$7:$G$150,7,FALSE)","v":"Mathieu Leander & Sascha"}]
["2018-09-11",{"$f":"VLOOKUP(D44,Kühe!$A$7:$G$150,7,FALSE)","v":"Zumofen / Gattlen"},{"$f":"VLOOKUP(D44,Kühe!$A$7:$G$150,2,FALSE)","v":"Fangjo"},101,3,{"$f":"VLOOKUP(E44,Kühe!$A$7:$G$150,2,FALSE)","v":"Pinka"},{"$f":"VLOOKUP(E44,Kühe!$A$7:$G$150,7,FALSE)","v":"Bayard Medard & Gustav"}]
["2018-09-11",{"$f":"VLOOKUP(D45,Kühe!$A$7:$G$150,7,FALSE)","v":"Zumofen / Gattlen"},{"$f":"VLOOKUP(D45,Kühe!$A$7:$G$150,2,FALSE)","v":"Puma"},105,101,{"$f":"VLOOKUP(E45,Kühe!$A$7:$G$150,2,FALSE)","v":"Fangjo"},{"$f":"VLOOKUP(E45,Kühe!$A$7:$G$150,7,FALSE)","v":"Zumofen / Gattlen"}]
["2018-09-10",{"$f":"VLOOKUP(D46,Kühe!$A$7:$G$150,7,FALSE)","v":"Bregy Anja"},{"$f":"VLOOKUP(D46,Kühe!$A$7:$G$150,2,FALSE)","v":"Diabolo"},6,71,{"$f":"VLOOKUP(E46,Kühe!$A$7:$G$150,2,FALSE)","v":"Bonita"},{"$f":"VLOOKUP(E46,Kühe!$A$7:$G$150,7,FALSE)","v":"Stallung Passeraub"}]
["2018-09-10",{"$f":"VLOOKUP(D47,Kühe!$A$7:$G$150,7,FALSE)","v":"Mathieu Leander & Sascha"},{"$f":"VLOOKUP(D47,Kühe!$A$7:$G$150,2,FALSE)","v":"Bambino"},60,30,{"$f":"VLOOKUP(E47,Kühe!$A$7:$G$150,2,FALSE)","v":"Dixence"},{"$f":"VLOOKUP(E47,Kühe!$A$7:$G$150,7,FALSE)","v":"Fux Wendelin, Jenny & Wyer Piet"}]
["2018-09-10",{"$f":"VLOOKUP(D48,Kühe!$A$7:$G$150,7,FALSE)","v":"Williner  Anton"},{"$f":"VLOOKUP(D48,Kühe!$A$7:$G$150,2,FALSE)","v":"Tira"},90,75,{"$f":"VLOOKUP(E48,Kühe!$A$7:$G$150,2,FALSE)","v":"Pandora"},{"$f":"VLOOKUP(E48,Kühe!$A$7:$G$150,7,FALSE)","v":"Stallung zum Stäg"}]
["2018-09-10",{"$f":"VLOOKUP(D49,Kühe!$A$7:$G$150,7,FALSE)","v":"Wyssen Diego & Madlen"},{"$f":"VLOOKUP(D49,Kühe!$A$7:$G$150,2,FALSE)","v":"Xanja"},94,62,{"$f":"VLOOKUP(E49,Kühe!$A$7:$G$150,2,FALSE)","v":"Bavaria"},{"$f":"VLOOKUP(E49,Kühe!$A$7:$G$150,7,FALSE)","v":"Mathieu Leander & Sascha"}]
["2018-09-10",{"$f":"VLOOKUP(D50,Kühe!$A$7:$G$150,7,FALSE)","v":"Jäger Carlo"},{"$f":"VLOOKUP(D50,Kühe!$A$7:$G$150,2,FALSE)","v":"Bandit"},50,59,{"$f":"VLOOKUP(E50,Kühe!$A$7:$G$150,2,FALSE)","v":"Baghira"},{"$f":"VLOOKUP(E50,Kühe!$A$7:$G$150,7,FALSE)","v":"Mathieu Leander & Sascha"}]
["2018-09-10",{"$f":"VLOOKUP(D51,Kühe!$A$7:$G$150,7,FALSE)","v":"Zumofen / Gattlen"},{"$f":"VLOOKUP(D51,Kühe!$A$7:$G$150,2,FALSE)","v":"Fayola"},102,60,{"$f":"VLOOKUP(E51,Kühe!$A$7:$G$150,2,FALSE)","v":"Bambino"},{"$f":"VLOOKUP(E51,Kühe!$A$7:$G$150,7,FALSE)","v":"Mathieu Leander & Sascha"}]
["2018-09-10",{"$f":"VLOOKUP(D52,Kühe!$A$7:$G$150,7,FALSE)","v":"Bregy Ralf & Adolf"},{"$f":"VLOOKUP(D52,Kühe!$A$7:$G$150,2,FALSE)","v":"Creola"},8,67,{"$f":"VLOOKUP(E52,Kühe!$A$7:$G$150,2,FALSE)","v":"Bombache"},{"$f":"VLOOKUP(E52,Kühe!$A$7:$G$150,7,FALSE)","v":"Stallung Passeraub"}]
["2018-09-10",{"$f":"VLOOKUP(D53,Kühe!$A$7:$G$150,7,FALSE)","v":"Bregy Uli & Pascal"},{"$f":"VLOOKUP(D53,Kühe!$A$7:$G$150,2,FALSE)","v":"Tiranie"},19,82,{"$f":"VLOOKUP(E53,Kühe!$A$7:$G$150,2,FALSE)","v":"Carolin"},{"$f":"VLOOKUP(E53,Kühe!$A$7:$G$150,7,FALSE)","v":"Tscherry Erwin & Bernhard"}]
["2018-09-10",{"$f":"VLOOKUP(D54,Kühe!$A$7:$G$150,7,FALSE)","v":"Zumofen / Gattlen"},{"$f":"VLOOKUP(D54,Kühe!$A$7:$G$150,2,FALSE)","v":"Puma"},105,95,{"$f":"VLOOKUP(E54,Kühe!$A$7:$G$150,2,FALSE)","v":"Xena"},{"$f":"VLOOKUP(E54,Kühe!$A$7:$G$150,7,FALSE)","v":"Wyssen Diego & Madlen"}]
["2018-09-10",{"$f":"VLOOKUP(D55,Kühe!$A$7:$G$150,7,FALSE)","v":"Hischier Pius"},{"$f":"VLOOKUP(D55,Kühe!$A$7:$G$150,2,FALSE)","v":"Shakira"},49,97,{"$f":"VLOOKUP(E55,Kühe!$A$7:$G$150,2,FALSE)","v":"Coucou"},{"$f":"VLOOKUP(E55,Kühe!$A$7:$G$150,7,FALSE)","v":"Familie Zumoberhaus"}]
["2018-09-10",{"$f":"VLOOKUP(D56,Kühe!$A$7:$G$150,7,FALSE)","v":"Jäger Carlo"},{"$f":"VLOOKUP(D56,Kühe!$A$7:$G$150,2,FALSE)","v":"Maila"},52,59,{"$f":"VLOOKUP(E56,Kühe!$A$7:$G$150,2,FALSE)","v":"Baghira"},{"$f":"VLOOKUP(E56,Kühe!$A$7:$G$150,7,FALSE)","v":"Mathieu Leander & Sascha"}]
["2018-09-10",{"$f":"VLOOKUP(D57,Kühe!$A$7:$G$150,7,FALSE)","v":"Mathieu Leander & Sascha"},{"$f":"VLOOKUP(D57,Kühe!$A$7:$G$150,2,FALSE)","v":"Baghira"},59,50,{"$f":"VLOOKUP(E57,Kühe!$A$7:$G$150,2,FALSE)","v":"Bandit"},{"$f":"VLOOKUP(E57,Kühe!$A$7:$G$150,7,FALSE)","v":"Jäger Carlo"}]
["2018-09-10",{"$f":"VLOOKUP(D58,Kühe!$A$7:$G$150,7,FALSE)","v":"Bregy Uli & Pascal"},{"$f":"VLOOKUP(D58,Kühe!$A$7:$G$150,2,FALSE)","v":"Tiranie"},19,82,{"$f":"VLOOKUP(E58,Kühe!$A$7:$G$150,2,FALSE)","v":"Carolin"},{"$f":"VLOOKUP(E58,Kühe!$A$7:$G$150,7,FALSE)","v":"Tscherry Erwin & Bernhard"}]
["2018-09-10",{"$f":"VLOOKUP(D59,Kühe!$A$7:$G$150,7,FALSE)","v":"Hischier Pius"},{"$f":"VLOOKUP(D59,Kühe!$A$7:$G$150,2,FALSE)","v":"Pablo"},47,73,{"$f":"VLOOKUP(E59,Kühe!$A$7:$G$150,2,FALSE)","v":"Benika"},{"$f":"VLOOKUP(E59,Kühe!$A$7:$G$150,7,FALSE)","v":"Stallung zum Stäg"}]
["2018-09-09",{"$f":"VLOOKUP(D60,Kühe!$A$7:$G$150,7,FALSE)","v":"Familie Zumoberhaus"},{"$f":"VLOOKUP(D60,Kühe!$A$7:$G$150,2,FALSE)","v":"Nana"},98,34,{"$f":"VLOOKUP(E60,Kühe!$A$7:$G$150,2,FALSE)","v":"Scarlette"},{"$f":"VLOOKUP(E60,Kühe!$A$7:$G$150,7,FALSE)","v":"Fux Wendelin, Jenny & Wyer Piet"}]
{"$rows_left_out":1170}
{"sheet":"Kühe","index":1,"n_rows":116,"n_cols":7,"rows_kept":116,"cut":false,"hidden":false,"merged":[[4,0,4,6]]}
[]
[]
[]
[]
["Rot = Troupeau-Siegerin "]
["Nr.","Name","Ohrmarkennr.","Geburtsdat.","Vater","Mutter","Eigentümer"]
[1,"Diabolo","120.0898.9041.4","2011-11-07","@PARATI","DRAGON","Bayard Medard & Gustav"]
[2,"Mirabelle","120.0998.9046.6","30.10.2012","MESSI","MERY","Bayard Medard & Gustav"]
[3,"Pinka","120.0998.9038.1","14.11.2011","@CLINTON","PUMA","Bayard Medard & Gustav"]
[4,"Ramona","120.0998.9034.3","29.10.2011","VITUS","RIQUITA","Bayard Medard & Gustav"]
[5,"Violette","120.0764.8382.7","13.12.2008","ATTILA","VICTORINE","Bayard Medard & Gustav"]
[6,"Diabolo","120.0708.9312.7","19.11.2014","#TEIRO","CREOLA","Bregy Anja"]
[7,"Canaille","120.0931.3322.4","17.10.2012","$BREONA","CHEALSY","Bregy Ralf & Adolf"]
[8,"Creola","120.0935.2375.9","18.10.2011","$BREONA","DORINA","Bregy Ralf & Adolf"]
[9,"Flacari","120.0931.3303.3","17.11.2010","@CARIBOU","FLASH","Bregy Ralf & Adolf"]
[10,"Lacoste","120.0931.3319.4","03.10.2012","CLINTON","LOREN","Bregy Ralf & Adolf"]
[11,"Santiago","120.0931.3328.6","02.12.2012","#TEIRO","SCHEILA","Bregy Ralf & Adolf"]
[12,"Milow","120.0931.3304.0","26.09.2011","$BREONA","MARUSCHKA","Bregy Patrick & Silvan"]
[13,"Tequilla","120.0931.3329.3","02.12.2012","#TEIRO","TRACONIA","Bregy Patrick & Silvan"]
[14,"Calin","120.0919.1804.5","07.10.2010","BOCASSA","CALIMERO","Bregy Uli & Pascal"]
[15,"Catalina","120.1050.6420.1","11.10.2013","SHACARI","CALINE","Bregy Uli & Pascal"]
[16,"Cora","120.1050.6419.5","10.10.2013","SHACARI","COBRA","Bregy Uli & Pascal"]
[17,"Pandora","120.1050.6417.1","02.01.2013","$TARTUFF","PALOMA","Bregy Uli & Pascal"]
[18,"Souki","120.0745.7355.1","27.10.2009","COQUIN","MIRAGE","Bregy Uli & Pascal"]
[19,"Tiranie","120.1121.4498.9","23.11.2013","ZOLA","TSATAGNE","Bregy Uli & Pascal"]
[20,"Bijoux","120.0840.8555.6","04.11.2009","@TIGRE 09","BARON","Familie Leiggener"]
[21,"Bulle","120.1000.4525.0","14.11.2012","#TORRES","BRISKA","Familie Leiggener"]
[22,"Rambo","120.0745.5898.5","23.10.2008","MASTAR","ROXEN","Familie Leiggener"]
[23,"Rebell","120.0761.3757.7","28.09.2010","@BIRK","RIVA","Familie Leiggener"]
[24,"Tigres","120.0745.7790.0","15.12.2008","BOCASSA","TITO","Familie Leiggener"]
[25,"Andora","120.0843.1657.5","04.11.2009","TURKO","AYCHA","Fux Wendelin, Jenny & Wyer Piet"]
[26,"Ares","120.1119.8620.7","15.10.2014","TIGER","ANDORA","Fux Wendelin, Jenny & Wyer Piet"]
[27,"Bolero","120.1119.8616.0","11.11.2013","TIGER","BAGUERA","Fux Wendelin, Jenny & Wyer Piet"]
[28,"Bresil","120.1055.7163.1","19.01.2013","#TORRES","AFIFA","Fux Wendelin, Jenny & Wyer Piet"]
[29,"Caprise","120.0916.4223.0","08.01.2011","@CARLOS","CALMY","Fux Wendelin, Jenny & Wyer Piet"]
[30,"Dixence","120.0995.2550.4","09.11.2012","MAGIC","DIAMANT","Fux Wendelin, Jenny & Wyer Piet"]
[31,"Mystic","120.0995.2546.7","17.10.2012","MAGIC","ETOILE","Fux Wendelin, Jenny & Wyer Piet"]
[32,"Pigalle","120.0995.2553.5","22.11.2011","MAGIC","PANDORA","Fux Wendelin, Jenny & Wyer Piet"]
[33,"Samantha","120.0995.2548.1","04.11.2012","MAGIC","BAGUERA","Fux Wendelin, Jenny & Wyer Piet"]
[34,"Scarlette","120.1119.8620.7","14.11.2014","TIGER","ANDORA","Fux Wendelin, Jenny & Wyer Piet"]
[35,"Souris","120.1119.8615.3","11.11.2013","TIGER","SANTANA","Fux Wendelin, Jenny & Wyer Piet"]
[36,"Valaisanne","120.1186.6943.1","07.01.2015","VAMPIR","VAGABONDE","Fux Wendelin, Jenny & Wyer Piet"]
[37,"Tango","120.0619.4600.9","26.01.2007","@POLUX","TIGER","Gebrüder Jäger"]
[38,"Tirana","120.1051.3478.2","09.12.2012","$TARTUFF","TIGER","Gebrüder Jäger"]
[39,"Bandit","120.0478.7410.4","09.11.2005","PANADOL","BELON","Gebrüder Jäger"]
[40,"Barilona","120.1153.2314.5","23.11.2014","KEIRO","BARON","Gebrüder Jäger"]
[41,"Bessy","120.1118.9222.5","09.10.2013","KEIRO","BLERINA","Gebrüder Jäger"]
[42,"Tiger","120.1153.2306.0","28.10.2014","KEIRO","TINA","Gebrüder Jäger"]
[43,"Dorina","120.1153.2313.8","21.11.2014","KEIRO","DIJONE","Gebrüder Jäger"]
[44,"Tamango","120.0919.0508.3","15.11.2010","KEIRO","TINA","Gebrüder Jäger"]
[45,"Taylor","120.1118.9230.0","29.11.2013","$TARTUFF","TAMANGO","Gebrüder Jäger"]
[46,"Lorens","120.11181.9224.9","2013-10-19","Monza","Micabol","Gebrüder Jäger"]
[47,"Pablo","120.0990.3391.7","02.12.2013","SATYR","PUMA","Hischier Pius"]
[48,"Pelila","120.0990.3390.0","02.12.2013","SATYR","PUMA","Hischier Pius"]
[49,"Shakira","120.0623.7070.4","16.12.2013","@VALENTINO","SAFIRA","Hischier Pius"]
[50,"Bandit","120.1042.9275.9","12.10.2012","NERO","BELONE","Jäger Carlo"]
[51,"Guxa","120.0764.2445.5","02.10.2009","XAVER","YAKIN","Jäger Carlo"]
[52,"Maila","120.1055.8462.4","18.11.2012","RAMBAR","MONA","Jäger Carlo"]
[53,"Mirtille","120.1048.6409.3","09.12.2012","PRINCE","MISTRAL","Jäger Carlo"]
[54,"Paloma","120.1068.9664.1","18.03.2013","NERO","PRINCESSE","Jäger Carlo"]
{"$rows_left_out":56}